{"text_format":"1","workbook":"xlsx","n_sheets":3,"sheets":["調査票","（参考）調査票【入力例】_rev1","（参考）調査対象設備"],"not_rendered":{"charts":0,"images":0,"macros":1,"external_links":0,"defined_names":6,"comments":0,"pivot_tables":0},"unopened":[],"bounds":{"document_bytes":16777216,"sheet_cells":100000,"rows_first":2000,"rows_last":500,"rows_between":2000,"halvings":0,"cell_chars":16384,"cell_head_chars":4096},"cells_cut":0,"cells_raw":0,"read":"whole","date_system":"1900"}

{"sheet":"調査票","index":0,"n_rows":16,"n_cols":9,"rows_kept":16,"cut":false,"hidden":false,"merged":[[0,1,0,8],[12,1,13,1],[12,3,13,3],[12,2,13,2],[12,6,13,6],[12,7,12,8],[12,4,12,5],[10,1,10,8]]}
[null,"工事設計認証を受けた特定無線設備に係る検査を行った特定無線設備の数量等の報告"]
[]
[null,null,null,null,null,null,null,"年　　月　　日"]
[null,"　総務大臣　殿",null,null,null,"郵便番号"]
[null,null,null,null,null,"住所"]
[null,null,null,null,null,"氏名（法人にあっては、名称及び代表者の氏名）　　　　　　"]
[]
[null,null,null,null,null,"担当者氏名及び連絡先"]
[]
[]
[null,"　電波法第38条の２の２第１項第１号に規定する事業に係る無線設備（免許不要局（登録局を除く。））であって、714MHz以下の周波数の電波を使用するものについて、令和２年度から令和３年度までの期間における検査を行った数量を以下のとおり報告します。"]
[]
[null,"型式又は名称","工事設計認証番号","特定無線設備の種別","周波数",null,"認証年月日","検査を行った特定無線設備の数量"]
[null,null,null,null,"認証取得範囲","技術基準",null,"R2年度","R3年度"]
["（例）","MODEL ABC","099-123456","第2条第1項第8号に掲げる無線設備（テレメータ、テレコントロール、データ伝送）","426.0250～426.1375MHz\n (12.5KHｚ間隔　10波)　",{"$f":"IFERROR(VLOOKUP($D15,'（参考）調査対象設備'!$A$4:$C$16,3,FALSE),\"\")","v":"312MHz～315.25MHz、410MHz～430MHz、440MHz～470MHz"},"2021-04-10",0,300]
[null,null,null,null,null,{"$f":"IFERROR(VLOOKUP($D16,'（参考）調査対象設備'!$A$4:$C$16,3,FALSE),\"\")","v":""},null,0,0]

{"sheet":"（参考）調査票【入力例】_rev1","index":1,"n_rows":16,"n_cols":9,"rows_kept":16,"cut":false,"hidden":false,"merged":[[0,1,0,8],[10,1,10,8],[12,1,13,1],[12,2,13,2],[12,3,13,3],[12,4,12,5],[12,6,13,6],[12,7,12,8]]}
[null,"工事設計認証を受けた特定無線設備に係る検査を行った特定無線設備の数量等の報告"]
[]
[null,null,null,null,null,null,null,"2022-07-20"]
[null,"　総務大臣　殿",null,null,null,"郵便番号","100-8926"]
[null,null,null,null,null,"住所","東京都千代田区霞が関２－１－２"]
[null,null,null,null,null,"氏名（法人にあっては、名称及び代表者の氏名）　　　　　　"]
[null,null,null,null,null,null,"株式会社総務　代表取締役社長　総務　太郎"]
[null,null,null,null,null,"担当者氏名及び連絡先"]
[null,null,null,null,null,null,"総務部総務課総務係　総務　一郎"]
[]
[null,"　電波法第38条の２の２第１項第１号に規定する事業に係る無線設備（免許不要局（登録局を除く。））であって、714MHz以下の周波数の電波を使用するものについて、令和２年度から令和３年度までの期間における検査を行った数量を以下のとおり報告します。"]
[]
[null,"型式又は名称","工事設計認証番号","特定無線設備の種別","周波数",null,"認証年月日","検査を行った特定無線設備の数量"]
[null,null,null,null,"認証取得範囲","技術基準",null,"R2年度","R3年度"]
["（例）","MODEL ABC","099-123456","第2条第1項第8号に掲げる無線設備（テレメータ、テレコントロール、データ伝送）","426.0250～426.1375MHz\n (12.5KHｚ間隔　10波)",{"$f":"IFERROR(VLOOKUP($D15,'（参考）調査対象設備'!A4:C16,3,FALSE),\"\")","v":"312MHz～315.25MHz、410MHz～430MHz、440MHz～470MHz"},"2021-04-10",0,300]
[null,null,null,null,null,{"$f":"IFERROR(VLOOKUP($D16,'（参考）調査対象設備'!$A$4:$C$16,3,FALSE),\"\")","v":""},null,0,0]

{"sheet":"（参考）調査対象設備","index":2,"n_rows":16,"n_cols":3,"rows_kept":16,"cut":false,"hidden":false,"merged":[]}
["対象設備一覧"]
[]
["特定無線設備の種別（証明規則における該当項目）","システムの説明","使用周波数"]
["第2条第1項第3号に掲げる無線設備","市民ラジオ","26.9MHz～27.2MHz"]
["第2条第1項第7号に掲げる無線設備","コードレス電話","253.8625MHz～254.9625MHz、380.2125MHz～381.3125MHz"]
["第2条第1項第8号に掲げる無線設備（テレメータ、テレコントロール、データ伝送）","特定小電力無線局（テレメータ、テレコントロール、データ伝送）","312MHz～315.25MHz、410MHz～430MHz、440MHz～470MHz"]
["第2条第1項第8号に掲げる無線設備（医療用テレメータ）","特定小電力無線局（医療用テレメータ）","410MHz～430MHz、440MHz～470MHz"]
["第2条第1項第8号に掲げる無線設備（体内埋込型医療用データ伝送、体内植込型医療用遠隔計測）","特定小電力無線局（体内埋込型医療用データ伝送、体内植込型医療用遠隔計測）","401MHz～406MHz"]
["第2条第1項第8号に掲げる無線設備（国際輸送用データ伝送設備、国際輸送用データ制御設備）","特定小電力無線局（国際輸送用データ伝送設備、国際輸送用データ制御設備）","433.67MHz～434.17MHz"]
["第2条第1項第8号に掲げる無線設備（無線呼出）","特定小電力無線局（無線呼出）","410MHz～430MHz"]
["第2条第1項第8号に掲げる無線設備（ラジオマイク）","特定小電力無線局（ラジオマイク）","73.6MHz～74.8MHz、322MHz～323MHz"]
["第2条第1項第8号に掲げる無線設備（補聴援助用ラジオマイク）","特定小電力無線局（補聴援助用ラジオマイク）","75.2MHz～76.0MHz、169.39MHz～169.81MHz"]
["第2条第1項第8号に掲げる無線設備（無線電話）","特定小電力無線局（無線電話）","410MHz～430MHz、440MHz～470MHz"]
["第2条第1項第8号に掲げる無線設備（音声アシスト用無線電話）","特定小電力無線局（音声アシスト用無線電話）","75.2MHz～76.0MHz"]
["第2条第1項第8号に掲げる無線設備（人・動物検知通報システム）","特定小電力無線局（人・動物検知通報システム）","142.93MHz～142.99MHz、146.93MHz～146.99MHz"]
["第2条第1項第13号に掲げる無線設備","小電力セキュリティ","426.25MHz～426.8375MHz"]