{"text_format":"1","workbook":"xlsx","n_sheets":5,"sheets":["調査票","（参考）調査票【入力例】","（参考）警告が表示される場合のご対応方法","（参考）調査対象設備","【非表示】管理用"],"not_rendered":{"charts":0,"images":3,"macros":1,"external_links":0,"defined_names":6,"comments":0,"pivot_tables":0},"unopened":[],"bounds":{"document_bytes":16777216,"sheet_cells":100000,"rows_first":2000,"rows_last":500,"rows_between":2000,"halvings":0,"cell_chars":16384,"cell_head_chars":4096},"cells_cut":0,"cells_raw":0,"read":"whole","date_system":"1900"}

{"sheet":"調査票","index":0,"n_rows":17,"n_cols":9,"rows_kept":17,"cut":false,"hidden":false,"merged":[[2,5,2,8],[7,6,7,8],[5,6,5,8],[0,1,0,8],[13,1,14,1],[13,3,14,3],[13,2,14,2],[13,6,14,6],[13,7,13,8],[13,4,13,5],[11,1,11,8],[3,6,3,8],[4,6,4,8],[6,6,6,8],[8,6,8,8],[9,6,9,8]]}
[null,"工事設計認証を受けた特定無線設備に係る検査を行った特定無線設備の数量等の報告"]
[]
[null,null,null,null,null,"令和　　　年　　月　　日"]
[null,"　総務大臣　殿",null,null,null,"郵便番号"]
[null,null,null,null,null,"住所"]
[null,null,null,null,null,"氏名または法人名　　　"]
[null,null,null,null,null,"代表者の氏名\n※法人のみ"]
[null,null,null,null,null,"担当者氏名"]
[null,null,null,null,null,"連絡先（メールアドレス）"]
[null,null,null,null,null,"連絡先（電話番号）"]
[]
[null,"　電波法第38条の２の２第１項第１号に規定する事業に係る無線設備（免許不要局（登録局を除く。））であって、714MHz超の周波数の電波を使用するものについて、令和３年度から令和４年度までの期間(2021/04/01～2023/03/31)における検査を行った数量を以下のとおり報告します。"]
[]
[null,"型式又は名称","工事設計認証番号","特定無線設備の種別","周波数",null,"認証年月日","検査を行った特定無線設備の数量"]
[null,null,null,null,"認証取得範囲","技術基準",null,"R3年度\n(2021/04/01～2022/03/31)","R4年度\n(2022/04/01～2023/03/31)"]
["（例）","MODEL ABC","099-123456","第2条第1項第19号に掲げる無線設備","2,402～2,480ＭＨz(２ＭＨz間隔40波)",{"$f":"IFERROR(VLOOKUP($D16,'（参考）調査対象設備'!$A$4:$C$41,3,FALSE),\"\")","v":"2,400MHz～2,483.5MHz"},"2022-04-10",0,300]
[null,null,null,null,null,{"$f":"IFERROR(VLOOKUP($D17,'（参考）調査対象設備'!$A$4:$C$41,3,FALSE),\"\")","v":""},null,0,0]

{"sheet":"（参考）調査票【入力例】","index":1,"n_rows":17,"n_cols":9,"rows_kept":17,"cut":false,"hidden":false,"merged":[[6,6,6,8],[0,1,0,8],[2,5,2,8],[3,6,3,8],[4,6,4,8],[5,6,5,8],[7,6,7,8],[8,6,8,8],[9,6,9,8],[11,1,11,8],[13,1,14,1],[13,2,14,2],[13,3,14,3],[13,4,13,5],[13,6,14,6],[13,7,13,8]]}
[null,"工事設計認証を受けた特定無線設備に係る検査を行った特定無線設備の数量等の報告"]
[]
[null,null,null,null,null,"令和　５年　８月　１日"]
[null,"　総務大臣　殿",null,null,null,"郵便番号","100-8926"]
[null,null,null,null,null,"住所","東京都千代田区霞が関２－１－２"]
[null,null,null,null,null,"氏名または法人名　　　","株式会社●●"]
[null,null,null,null,null,"代表者の氏名\n※法人のみ","代表取締役社長　総務　太郎"]
[null,null,null,null,null,"担当者氏名","総務部総務課総務係　総務　一郎"]
[null,null,null,null,null,"連絡先（メールアドレス）","●●●●@●●●●●●●●"]
[null,null,null,null,null,"連絡先（電話番号）","03-●●●●-●●●●"]
[]
[null,"　電波法第38条の２の２第１項第１号に規定する事業に係る無線設備（免許不要局（登録局を除く。））であって、714MHz超の周波数の電波を使用するものについて、令和３年度から令和４年度までの期間(2021/04/01～2023/03/31)における検査を行った数量を以下のとおり報告します。"]
[]
[null,"型式又は名称","工事設計認証番号","特定無線設備の種別","周波数",null,"認証年月日","検査を行った特定無線設備の数量"]
[null,null,null,null,"認証取得範囲","技術基準",null,"R3年度\n(2021/04/01～2022/03/31)","R4年度\n(2022/04/01～2023/03/31)"]
["（例）","MODEL ABC","099-123456","第2条第1項第19号に掲げる無線設備","2,402～2,480ＭＨz(２ＭＨz間隔40波)",{"$f":"IFERROR(VLOOKUP($D16,'（参考）調査対象設備'!$A$4:$C$41,3,FALSE),\"\")","v":"2,400MHz～2,483.5MHz"},"2022-04-10",0,300]
[null,null,null,null,null,{"$f":"IFERROR(VLOOKUP($D17,'（参考）調査対象設備'!$A$4:$C$41,3,FALSE),\"\")","v":""},null,0,0]

{"sheet":"（参考）警告が表示される場合のご対応方法","index":2,"n_rows":27,"n_cols":3,"rows_kept":27,"cut":false,"hidden":false,"merged":[]}
[]
[null,"次のような警告が表示される場合は、お手数ですが下記手順をお試しいただけますようお願いいたします。"]
[]
[]
[]
[]
[]
[]
[null,"手順1","ファイルを右クリックし、メニューから[プロパティ]を選択してください。"]
[]
[null,"手順2","[全般] タブの下部、[許可する]または[ブロック解除]のチェックボックスを選択して、[OK] を選択してください。"]
[]
[]
[]
[]
[]
[]
[]
[]
[]
[]
[]
[]
[]
[]
[]
[null,"※次の警告が表示される場合は[コンテンツの有効化]をクリックしていただくと、編集が可能となります。"]

{"sheet":"（参考）調査対象設備","index":3,"n_rows":41,"n_cols":3,"rows_kept":41,"cut":false,"hidden":false,"merged":[[3,1,4,1],[6,1,7,1],[8,1,10,1],[11,1,13,1],[31,1,32,1],[18,1,20,1]]}
["対象設備一覧"]
[]
["特定無線設備の種別（証明規則における該当項目）","システムの説明","使用周波数"]
["第2条第1項第8号に掲げる無線設備（テレメータ、テレコントロール、データ伝送）（915MHz～930MHz）","特定小電力無線局（テレメータ、テレコントロール、データ伝送）","915MHz～930MHz"]
["第2条第1項第8号に掲げる無線設備（テレメータ、テレコントロール、データ伝送）（1,215MHz～1,260MHz）",null,"1,215MHz～1,260MHz"]
["第2条第1項第8号に掲げる無線設備（ラジオマイク）","特定小電力無線局（ラジオマイク）","806MHz～810MHz"]
["第2条第1項第8号に掲げる無線設備（移動体識別）（915MHz～930MHz）","特定小電力無線局（移動体識別）","915MHz～930MHz"]
["第2条第1項第8号に掲げる無線設備（移動体識別）（2,400MHz～2483.5MHz）",null,"2,400MHz～2483.5MHz"]
["第2条第1項第8号に掲げる無線設備（ミリ波レーダー）（60GHz～61GHz）","特定小電力無線局（ミリ波レーダー）","60GHz～61GHz"]
["第2条第1項第8号に掲げる無線設備（ミリ波レーダー）（76GHz～77GHz）",null,"76GHz～77GHz"]
["第2条第1項第8号に掲げる無線設備（ミリ波レーダー）（77GHz～81GHz）",null,"77GHz～81GHz"]
["第2条第1項第8号に掲げる無線設備（移動体検知センサー用）（10.5GHz～10.55GHz）","特定小電力無線局（移動体検知センサー）","10.5GHz～10.55GHz"]
["第2条第1項第8号に掲げる無線設備（移動体検知センサー用）（24.05GHz～24.25GHz）",null,"24.05GHz～24.25GHz"]
["第2条第1項第8号に掲げる無線設備（移動体検知センサー用）（57GHz～66GHz）",null,"57GHz～66GHz"]
["第2条第1項第19号に掲げる無線設備","2.4GHz帯小電力データ通信システム①","2,400MHz～2,483.5MHz"]
["第2条第1項第19号の2に掲げる無線設備","2.4GHz帯小電力データ通信システム②","2,471MHz～2,497MHz"]
["第2条第1項第19号の2の2に掲げる無線設備","2.4GHz帯小電力データ通信システム③（屋外で使用する模型飛行機の無線操縦用）","2,400MHz～2,483.5MHz"]
["第2条第1項第19号の2の3に掲げる無線設備","2.4GHz帯高度化小電力データ通信システム④（屋外で使用する模型飛行機の無線操縦用）","2,471MHz～2,497MHz"]
["第2条第1項第19号の3に掲げる無線設備(5,150MHz～5,350MHz)","5GHz帯小電力データ通信システム","5,150MHz～5,350MHz"]
["第2条第1項第19号の3に掲げる無線設備(5,470MHz～5,730MHz)",null,"5,470MHz～5,730MHz"]
["第2条第1項第19号の3に掲げる無線設備(5,150MHz～5,350MHz、5,470MHz～5,730MHz)",null,"5,150MHz～5,350MHz、5,470MHz～5,730MHz"]
["第2条第1項第19号の4に掲げる無線設備","準ミリ波帯小電力データ通信システム","24.77GHz～25.23GHz、27.02GHz～27.46GHz"]
["第2条第１項第19号の4の2に掲げる無線設備","60GHz帯小電力データ通信システム①","57GHz～66GHz"]
["第2条第１項第19号の4の3に掲げる無線設備","60GHz帯小電力データ通信システム②（空中線電力10mW以下）","57GHz～66GHz"]
["第2条第1項第19号の11に掲げる無線設備","5GHz帯無線アクセスシステムの陸上移動局及び携帯局（空中線電力0.01W以下）","4,900MHz～5,000MHz"]
["第2条第1項第21号に掲げる無線設備","時分割多元接続方式狭帯域デジタルコードレス電話","1,893.65MHz～1,905.95MHz"]
["第2条第1項第21号の2に掲げる無線設備","時分割多元接続方式広帯域デジタルコードレス電話","1,895.616MHz～1,904.256MHz"]
["第2条第1項第21号の3に掲げる無線設備","時分割・直交周波数分割多元接続方式デジタルコードレス電話","1,891MHz～1,914.1MHz"]
["第2条第1項第22号に掲げる無線設備","PHS陸上移動局","1,884.65MHz～1,915.55MHz"]
["第2条第1項第32号に掲げる無線設備","狭帯域通信システムの陸上移動局","5.815GHz～5.845GHz"]
["第2条第1項第33号の2に掲げる無線設備","狭帯域通信システムの陸上移動局の無線設備の試験のための通信を行う無線局","5.775GHz～5.805GHz"]
["第2条第1項第47号に掲げる無線設備（3.4GHz～4.8GHz）","超広帯域無線システム①","3.4GHz～4.8GHz"]
["第2条第1項第47号に掲げる無線設備（7.25GHz～10.25GHz）",null,"7.25GHz～10.25GHz"]
["第2条第1項第47号の2に掲げる無線設備","超広帯域無線システム②","24.25GHz～29GHz"]
["第2条第1項第47号の3に掲げる無線設備","超広帯域無線システム③（7.587～8.4GHzの周波数のみを使用するもの）","7.587GHz～8.4GHz"]
["第2条第1項第47号の4に掲げる無線設備","超広帯域無線システム④","7.25GHz～9GHz"]
["第2条第1項第64号に掲げる無線設備","700MHz帯高度道路交通システムの陸上移動局","755.5MHz～764.5MHz"]
["第2条第1項第75号に掲げる無線設備","5.2GHz帯高出力データ通信システムの陸上移動局","5,150MHz～5,250MHz"]
["第2条第1項第78号に掲げる無線設備","5.2GHz帯小電力データ通信システム（自動車内用）","5,150MHz～5,250MHz"]
["第2条第1項第79号に掲げる無線設備","6GHz帯小電力データ通信システム（VLPモード）","5,925MHz～6,425MHz"]
["第2条第1項第80号に掲げる無線設備","6GHz帯小電力データ通信システム（LPIモード）","5,925MHz～6,425MHz"]

{"sheet":"【非表示】管理用","index":4,"n_rows":9,"n_cols":2,"rows_kept":9,"cut":false,"hidden":true,"merged":[]}
["調査票シートA列",{"$f":"COUNTA(調査票!A:A)","v":1}]
["調査票シートB列",{"$f":"COUNTA(調査票!B:B)","v":5}]
["調査票シートC列",{"$f":"COUNTA(調査票!C:C)","v":2}]
["調査票シートD列",{"$f":"COUNTA(調査票!D:D)","v":2}]
["調査票シートE列",{"$f":"COUNTA(調査票!E:E)","v":3}]
["調査票シートF列",{"$f":"COUNTA(調査票!F:F)","v":11}]
["調査票シートG列",{"$f":"COUNTA(調査票!G:G)","v":2}]
["調査票シートH列",{"$f":"COUNTA(調査票!H:H)","v":4}]
["調査票シートI列",{"$f":"COUNTA(調査票!I:I)","v":3}]